Target
Monocarboxylate transporter 1
Ligand
BDBM22001
Substrate
Meas. Tech.
ChEMBL_653483 (CHEMBL1226686)
Ki
0.275423±n/a nM
Citation
Target
Name:
Monocarboxylate transporter 1
Synonyms:
MCT 1 MOT1_HUMAN SLC16A1 | Solute carrier family 16 member 1
Type:
PROTEIN
Mol. Mass.:
53956.64
Organism:
Homo sapiens (Human)
Description:
ChEMBL_1451367
Residue:
500
  
Inhibitor
Name:
BDBM22001
Synonyms:
5-[(3-hydroxypropyl)sulfanyl]-3-methyl-1-(2-methylpropyl)-6-(naphthalen-1-ylmethyl)-1H,2H,3H,4H-thieno[2,3-d]pyrimidine-2,4-dione Thieno[2,3-d]pyrimidine-2,4(1H,3H)-dione, 3
Type:
Small organic molecule
Emp. Form.:
C25H28N2O3S2
Mol. Mass.:
468.631
SMILES:
CC(C)Cn1c2sc(Cc3cccc4ccccc34)c(SCCCO)c2c(=O)n(C)c1=O
: