Target
Beta-lactamase
Ligand
BDBM50324682
Substrate
Meas. Tech.
ChEMBL_650320 (CHEMBL1224978)
Ki
1000±n/a nM
Citation
 Babaoglu, KShoichet, BK Deconstructing fragment-based inhibitor discovery. Nat Chem Biol 2:720-3 (2006)  
Target
Name:
Beta-lactamase
Synonyms:
AMPC_ECOLI Beta-lactamase (AmpC) Cephalosporinase ampA | ampC
Type:
Protien
Mol. Mass.:
41561.62
Organism:
Escherichia coli
Description:
P00811
Residue:
377
  
Inhibitor
Name:
BDBM50324682
Synonyms:
3-(N-(4-carboxy-2-hydroxyphenyl)sulfamoyl)thiophene-2-carboxylic acid CHEMBL1222313
Type:
Small organic molecule
Emp. Form.:
C12H9NO7S2
Mol. Mass.:
343.332
SMILES:
OC(=O)c1sccc1S(=O)(=O)Nc1ccc(cc1O)C(O)=O
: