Target
Glyceraldehyde-3-phosphate dehydrogenase
Ligand
BDBM81264
Substrate
Meas. Tech.
ChEMBL_650326 (CHEMBL1224984)
IC50
8000±n/a nM
Citation
 Min, JKyung Kim, YCipriani, PGKang, MKhersonsky, SMWalsh, DPLee, JYNiessen, SYates, JRGunsalus, KPiano, FChang, YT Forward chemical genetic approach identifies new role for GAPDH in insulin signaling. Nat Chem Biol 3:55-9 (2007)  
Target
Name:
Glyceraldehyde-3-phosphate dehydrogenase
Synonyms:
G3P_HUMAN GAPDH glyceraldehyde-3-phosphate dehydrogenase
Type:
PROTEIN
Mol. Mass.:
36060.86
Organism:
Homo sapiens (Human)
Description:
ChEMBL_1511315
Residue:
335
  
Inhibitor
Name:
BDBM81264
Synonyms:
5-(2-aminoethyl)benzene-1,2,4-triol;hydrobromide 6-Hydroxydopamine hydrobromide MLS002207128 cid_176170
Type:
Small organic molecule
Emp. Form.:
C8H11NO3
Mol. Mass.:
169.1778
SMILES:
NCCc1cc(O)c(O)cc1O
: