Target
5-hydroxytryptamine receptor 6
Ligand
BDBM50324861
Substrate
Meas. Tech.
ChEMBL_651485 (CHEMBL1227602)
IC50
6±n/a nM
Citation
 Park, CMKim, SYPark, WKChoi, JHSeong, CM Synthesis and SAR of (piperazin-1-yl-phenyl)-arylsulfonamides: a novel series of atypical antipsychotic agents. Bioorg Med Chem Lett 20:5221-4 (2010)  
Target
Name:
5-hydroxytryptamine receptor 6
Synonyms:
5-HT-6 5-hydroxytryptamine receptor 6 (5-HT-6) 5-hydroxytryptamine receptor 6 (5HT6) HTR6 Serotonin 6 (5-HT6) receptor | Serotonin Receptor 6
Type:
G Protein-Coupled Receptor (GPCR)
Mol. Mass.:
46968.43
Organism:
Homo sapiens (Human)
Description:
P50406
Residue:
440
  
Inhibitor
Name:
BDBM50324861
Synonyms:
CHEMBL1221449 | Naphthalene-2-sulfonicacid cyclopropylmethyl-[3-(4-methyl-piperazin-1-yl)-phenyl]-amide
Type:
Small organic molecule
Emp. Form.:
C25H29N3O2S
Mol. Mass.:
435.582
SMILES:
CN1CCN(CC1)c1cccc(c1)N(CC1CC1)S(=O)(=O)c1ccc2ccccc2c1
: