Target
5-hydroxytryptamine receptor 1A
Ligand
BDBM50324865
Substrate
Meas. Tech.
ChEMBL_651486 (CHEMBL1227603)
IC50
57±n/a nM
Citation
 Park, CMKim, SYPark, WKChoi, JHSeong, CM Synthesis and SAR of (piperazin-1-yl-phenyl)-arylsulfonamides: a novel series of atypical antipsychotic agents. Bioorg Med Chem Lett 20:5221-4 (2010)  
Target
Name:
5-hydroxytryptamine receptor 1A
Synonyms:
5-HT-1A 5-hydroxytryptamine receptor 1A (5-HT-1A) ADRB2RL1 Dopamine D2 receptor and serotonin 1a receptor HTR1A | Serotonin receptor 1A
Type:
Mol. Mass.:
46122.49
Organism:
Homo sapiens (Human)
Description:
Residue:
422
  
Inhibitor
Name:
BDBM50324865
Synonyms:
CHEMBL1221497 | naphthalene-2-sulfonic acid [3-(4-methyl-piperazin-1-yl)-phenyl]-amide
Type:
Small organic molecule
Emp. Form.:
C21H23N3O2S
Mol. Mass.:
381.491
SMILES:
CN1CCN(CC1)c1cccc(NS(=O)(=O)c2ccc3ccccc3c2)c1
: