Target
5-hydroxytryptamine receptor 1A
Ligand
BDBM50324870
Substrate
Meas. Tech.
ChEMBL_651486 (CHEMBL1227603)
IC50
280±n/a nM
Citation
 Park, CMKim, SYPark, WKChoi, JHSeong, CM Synthesis and SAR of (piperazin-1-yl-phenyl)-arylsulfonamides: a novel series of atypical antipsychotic agents. Bioorg Med Chem Lett 20:5221-4 (2010)  
Target
Name:
5-hydroxytryptamine receptor 1A
Synonyms:
5-HT-1A 5-hydroxytryptamine receptor 1A (5-HT-1A) ADRB2RL1 Dopamine D2 receptor and serotonin 1a receptor HTR1A | Serotonin receptor 1A
Type:
Mol. Mass.:
46122.49
Organism:
Homo sapiens (Human)
Description:
Residue:
422
  
Inhibitor
Name:
BDBM50324870
Synonyms:
CHEMBL1221452 | Naphthalene-2-sulfonic acid benzyl-[3-(4-methyl-piperazin-1-yl)-phenyl]-amide
Type:
Small organic molecule
Emp. Form.:
C28H29N3O2S
Mol. Mass.:
471.614
SMILES:
CN1CCN(CC1)c1cccc(c1)N(Cc1ccccc1)S(=O)(=O)c1ccc2ccccc2c1
: