Target
5-hydroxytryptamine receptor 1A
Ligand
BDBM50324866
Substrate
Meas. Tech.
ChEMBL_651486 (CHEMBL1227603)
IC50
298±n/a nM
Citation
 Park, CMKim, SYPark, WKChoi, JHSeong, CM Synthesis and SAR of (piperazin-1-yl-phenyl)-arylsulfonamides: a novel series of atypical antipsychotic agents. Bioorg Med Chem Lett 20:5221-4 (2010)  
Target
Name:
5-hydroxytryptamine receptor 1A
Synonyms:
5-HT-1A 5-hydroxytryptamine receptor 1A (5-HT-1A) ADRB2RL1 Dopamine D2 receptor and serotonin 1a receptor HTR1A | Serotonin receptor 1A
Type:
Mol. Mass.:
46122.49
Organism:
Homo sapiens (Human)
Description:
Residue:
422
  
Inhibitor
Name:
BDBM50324866
Synonyms:
CHEMBL1222234 | Naphthalene-1-sulfonic acid isopropyl-[3-(4-methyl-piperazin-1-yl)-phenyl]-amide
Type:
Small organic molecule
Emp. Form.:
C24H29N3O2S
Mol. Mass.:
423.571
SMILES:
CC(C)N(c1cccc(c1)N1CCN(C)CC1)S(=O)(=O)c1cccc2ccccc12
: