Target
5-hydroxytryptamine receptor 2C
Ligand
BDBM50324886
Substrate
Meas. Tech.
ChEMBL_651484 (CHEMBL1227601)
IC50
4±n/a nM
Citation
 Park, CMKim, SYPark, WKChoi, JHSeong, CM Synthesis and SAR of (piperazin-1-yl-phenyl)-arylsulfonamides: a novel series of atypical antipsychotic agents. Bioorg Med Chem Lett 20:5221-4 (2010)  
Target
Name:
5-hydroxytryptamine receptor 2C
Synonyms:
5-HT-2C 5-HT2C-INI 5-HTR2C 5-hydroxytryptamine receptor 2C (5-HT-2C) 5HT-1C HTR1C Serotonin (5-HT3) receptor Serotonin Receptor 2C
Type:
G Protein-Coupled Receptor (GPCR)
Mol. Mass.:
51836.79
Organism:
Homo sapiens (Human)
Description:
P28335
Residue:
458
  
Inhibitor
Name:
BDBM50324886
Synonyms:
CHEMBL1222134 | naphthalene-2-sulfonic acid isopropyl-[3-(4-methyl-piperazin-1-yl)-phenyl]-amide
Type:
Small organic molecule
Emp. Form.:
C24H29N3O2S
Mol. Mass.:
423.571
SMILES:
CC(C)N(c1cccc(c1)N1CCN(C)CC1)S(=O)(=O)c1ccc2ccccc2c1
: