Target
Potassium voltage-gated channel subfamily H member 2
Ligand
BDBM50324922
Substrate
Meas. Tech.
ChEMBL_651537 (CHEMBL1227789)
IC50
7500±n/a nM
Citation
 Madden, JDod, JRGodemann, RKraemer, JSmith, MBiniszkiewicz, MHallett, DJBarker, JDyekjaer, JDHesterkamp, T Fragment-based discovery and optimization of BACE1 inhibitors. Bioorg Med Chem Lett 20:5329-33 (2010)  
Target
Name:
Potassium voltage-gated channel subfamily H member 2
Synonyms:
1,3-beta-glucan synthase component GLS2 ERG Eag-related protein 1 Ether-a-go-go-related gene (HERG) Ether-a-go-go-related gene potassium channel 1 Ether-a-go-go-related gene potassium channel 1 (hERG1) Ether-a-go-go-related protein 1 H-ERG KCNH2 Potassium voltage-gated channel subfamily H member 2 (hERG) Voltage-gated potassium channel subunit Kv11.1 hERG Potassium Channel 1 | putative potassium channel subunit
Type:
Multi-pass membrane protein
Mol. Mass.:
126672.65
Organism:
Homo sapiens (Human)
Description:
Q12809
Residue:
1159
  
Inhibitor
Name:
BDBM50324922
Synonyms:
(3S)-3-(2-amino-5-chloro-1H-benzimidazol-1-yl)-N-(cyclohexylmethyl)pentanamide CHEMBL1222240
Type:
Small organic molecule
Emp. Form.:
C19H27ClN4O
Mol. Mass.:
362.897
SMILES:
CC[C@@H](CC(=O)NCC1CCCCC1)n1c(N)nc2cc(Cl)ccc12
: