Target
Caspase-1
Ligand
BDBM50199769
Substrate
Meas. Tech.
ChEMBL_651545 (CHEMBL1227797)
Ki
0.6±n/a nM
Citation
 Galatsis, PCaprathe, BGilmore, JThomas, ALinn, KSheehan, SHarter, WKostlan, CLunney, EStankovic, CRubin, JBrady, KAllen, HTalanian, R Succinic acid amides as P2-P3 replacements for inhibitors of interleukin-1beta converting enzyme (ICE or caspase 1). Bioorg Med Chem Lett 20:5184-90 (2010)  
Target
Name:
Caspase-1
Synonyms:
CASP1 Caspase ICE IL1BCE Interleukin-1 beta-converting enzyme
Type:
Enzyme
Mol. Mass.:
45154.13
Organism:
Homo sapiens (Human)
Description:
P29466
Residue:
404
  
Inhibitor
Name:
BDBM50199769
Synonyms:
(S)-3-((1S,9S)-9-(isoquinoline-1-carboxamido)-6,10-dioxooctahydro-1H-pyridazino[1,2-a][1,2]diazepine-1-carboxamido)-4-oxobutanoic acid CHEMBL437105
Type:
Small organic molecule
Emp. Form.:
C24H25N5O7
Mol. Mass.:
495.4846
SMILES:
OC(=O)C[C@H](NC(=O)[C@@H]1CCCN2N1C(=O)[C@H](CCC2=O)NC(=O)c1nccc2ccccc12)C=O
: