Target
Kappa-type opioid receptor
Ligand
BDBM50325528
Substrate
Meas. Tech.
ChEMBL_652217 (CHEMBL1228490)
Ki
0.467±n/a nM
Citation
 Fujii, HIda, YHanamura, SOsa, YNemoto, TNakajima, MHasebe, KNakao, KMochizuki, HNagase, H Synthesis of pyrrolomorphinan derivatives as kappa opioid agonists. Bioorg Med Chem Lett 20:5035-8 (2010)  
Target
Name:
Kappa-type opioid receptor
Synonyms:
Kappa Opioid Receptor OPRK1 Opiate Kappa 1 | mu/kappa opioid receptor
Type:
G Protein-Coupled Receptor (GPCR)
Mol. Mass.:
42744.99
Organism:
Cavia porcellus (domestic guinea pig)
Description:
P41144
Residue:
380
  
Inhibitor
Name:
BDBM50325528
Synonyms:
CHEMBL1223831
Type:
Small organic molecule
Emp. Form.:
C32H32N2O4
Mol. Mass.:
508.6075
SMILES:
Cn1c(\C=C\C(=O)c2ccccc2)cc2C[C@@]3(O)[C@H]4Cc5ccc(O)c6O[C@@H](c12)[C@]3(CCN4CC1CC1)c56
: