Target
Cysteine protease
Ligand
BDBM50240948
Substrate
Meas. Tech.
ChEMBL_652322 (CHEMBL1225525)
Ki
5310±n/a nM
Citation
 Waag, TGelhaus, CRath, JStich, ALeippe, MSchirmeister, T Allicin and derivates are cysteine protease inhibitors with antiparasitic activity. Bioorg Med Chem Lett 20:5541-3 (2010)  
Target
Name:
Cysteine protease
Synonyms:
Rhodesain
Type:
PROTEIN
Mol. Mass.:
48425.78
Organism:
Trypanosoma brucei rhodesiense
Description:
ChEMBL_619861
Residue:
450
  
Inhibitor
Name:
BDBM50240948
Synonyms:
CHEMBL359965 allicin | thio-2-propene-1-sulfinic acid S-allyl ester
Type:
Small organic molecule
Emp. Form.:
C6H10OS2
Mol. Mass.:
162.273
SMILES:
C=CCSS(=O)CC=C
: