Target
D(2) dopamine receptor
Ligand
BDBM50325746
Substrate
Meas. Tech.
ChEMBL_652613 (CHEMBL1225816)
Ki
1±n/a nM
Citation
 Jean, MRenault, JLevoin, NDanvy, DCalmels, TBerrebi-Bertrand, IRobert, PSchwartz, JCLecomte, JMUriac, PCapet, M Synthesis and evaluation of amides surrogates of dopamine D3 receptor ligands. Bioorg Med Chem Lett 20:5376-9 (2010)  
Target
Name:
D(2) dopamine receptor
Synonyms:
D(2) dopamine receptor DOPAMINE D2 Long DRD2 Dopamine D2 receptor Dopamine D2 receptor (D2R) Dopamine2-like | d2
Type:
Cell-surface receptors
Mol. Mass.:
50647.10
Organism:
Homo sapiens (Human)
Description:
P14416
Residue:
443
  
Inhibitor
Name:
BDBM50325746
Synonyms:
CHEMBL1223748 | N-(4-(4-(2-methoxyphenyl)piperazin-1-yl)butyl)isoquinolin-1-amine
Type:
Small organic molecule
Emp. Form.:
C24H30N4O
Mol. Mass.:
390.5212
SMILES:
COc1ccccc1N1CCN(CCCCNc2nccc3ccccc23)CC1
: