Target
Sodium channel protein type 9 subunit alpha
Ligand
BDBM50325765
Substrate
Meas. Tech.
ChEMBL_652622 (CHEMBL1225825)
Ki
13±n/a nM
Citation
 Tyagarajan, SChakravarty, PKZhou, BTaylor, BFisher, MHWyvratt, MJLyons, KKlatt, TLi, XKumar, SWilliams, BFelix, JPriest, BTBrochu, RMWarren, VSmith, MGarcia, MKaczorowski, GJMartin, WJAbbadie, CMcGowan, EJochnowitz, NParsons, WH Substituted biaryl pyrazoles as sodium channel blockers. Bioorg Med Chem Lett 20:5480-3 (2010)  
Target
Name:
Sodium channel protein type 9 subunit alpha
Synonyms:
NENA Peripheral sodium channel 1 SCN9A_HUMAN Voltage-gated sodium channel subunit Nav1.7 hNE-Na
Type:
Protein
Mol. Mass.:
226375.97
Organism:
Homo sapiens (Human)
Description:
Q15858
Residue:
1988
  
Inhibitor
Name:
BDBM50325765
Synonyms:
3-(4-(4-chloro-2-fluorophenoxy)phenyl)-1H-pyrazole-1-carboxamide | CHEMBL1224198
Type:
Small organic molecule
Emp. Form.:
C16H11ClFN3O2
Mol. Mass.:
331.729
SMILES:
NC(=O)n1ccc(n1)-c1ccc(Oc2ccc(Cl)cc2F)cc1
: