Target
Tyrosine-protein kinase Fyn
Ligand
BDBM50229961
Substrate
Meas. Tech.
ChEMBL_660473 (CHEMBL1250103)
IC50
600±n/a nM
Citation
 Saghatelian, ACravatt, BF Assignment of protein function in the postgenomic era. Nat Chem Biol 1:130-42 (2006)  
Target
Name:
Tyrosine-protein kinase Fyn
Synonyms:
FYN Proto-oncogene Syn SLK Src-like kinase | p59-Fyn
Type:
Enzyme
Mol. Mass.:
60762.21
Organism:
Homo sapiens (Human)
Description:
P06241
Residue:
537
  
Inhibitor
Name:
BDBM50229961
Synonyms:
1-(1,1-dimethylethyl)-3-(1-naphthalenyl)-1H-pyrazolo[3,4-d]pyrimidin-4-amine 1-NA-PP1 1-tert-butyl-3-naphthalen-1-yl-1H-pyrazolo[3,4-d]pyrimidin-4-amine CHEMBL264406 US11247972, Compound 1 | US9765037, Compound 1
Type:
Small organic molecule
Emp. Form.:
C19H19N5
Mol. Mass.:
317.3877
SMILES:
CC(C)(C)n1nc(-c2cccc3ccccc23)c2c(N)ncnc12
: