Target
Plasma kallikrein
Ligand
BDBM50326020
Substrate
Meas. Tech.
ChEMBL_655590 (CHEMBL1244634)
IC50
>10000±n/a nM
Citation
 Heinis, CRutherford, TFreund, SWinter, G Phage-encoded combinatorial chemical libraries based on bicyclic peptides. Nat Chem Biol 5:502-7 (2009)  
Target
Name:
Plasma kallikrein
Synonyms:
Fletcher factor KLKB1 Kallikrein Plasma kallikrein heavy chain Plasma prekallikrein
Type:
Protein
Mol. Mass.:
71391.16
Organism:
Homo sapiens (Human)
Description:
P03952
Residue:
638
  
Inhibitor
Name:
BDBM50326020
Synonyms:
(2R,3S,6S,9S,12S,15S,18R,21S,27S)-6-((1H-indol-3-yl)methyl)-9-(2-amino-2-oxoethyl)-3-((S)-2-((R)-1-(2-amino-2-oxoethylamino)-3-mercapto-1-oxopropan-2-ylcarbamoyl)pyrrolidine-1-carbonyl)-27-((5S,11R,14R)-14-amino-5-((S)-1-hydroxyethyl)-11-(mercaptomethyl)-4,7,10,13-tetraoxo-3,6,9,12-tetraazapentadecanamido)-15,21-bis(3-guanidinopropyl)-2-hydroxy-12-isopropyl-18-(mercaptomethyl)-5,8,11,14,17,20,23,26-octaoxo-4,7,10,13,16,19,22,25-octaazatriacontan-30-oic acid | CHEMBL1240700
Type:
Small organic molecule
Emp. Form.:
C70H112N26O22S3
Mol. Mass.:
1765.994
SMILES:
CC(C)[C@H](NC(=O)[C@H](CCCN=C(N)N)NC(=O)[C@H](CS)NC(=O)[C@H](CCCN=C(N)N)NC(=O)CNC(=O)[C@H](CCC(O)=O)NC(=O)CNC(=O)[C@@H](NC(=O)CNC(=O)[C@H](CS)NC(=O)[C@@H](C)N)[C@H](C)O)C(=O)N[C@@H](CC(N)=O)C(=O)N[C@@H](Cc1c[nH]c2ccccc12)C(=O)N[C@@H]([C@@H](C)O)C(=O)N1CCC[C@H]1C(=O)N[C@@H](CS)C(=O)NCC(N)=O
: