Target
Plasma kallikrein
Ligand
BDBM50326042
Substrate
Meas. Tech.
ChEMBL_655590 (CHEMBL1244634)
IC50
1500±n/a nM
Citation
 Heinis, CRutherford, TFreund, SWinter, G Phage-encoded combinatorial chemical libraries based on bicyclic peptides. Nat Chem Biol 5:502-7 (2009)  
Target
Name:
Plasma kallikrein
Synonyms:
Fletcher factor KLKB1 Kallikrein Plasma kallikrein heavy chain Plasma prekallikrein
Type:
Protein
Mol. Mass.:
71391.16
Organism:
Homo sapiens (Human)
Description:
P03952
Residue:
638
  
Inhibitor
Name:
BDBM50326042
Synonyms:
CHEMBL1240595
Type:
Small organic molecule
Emp. Form.:
C84H120N26O23S4
Mol. Mass.:
1990.272
SMILES:
CSCC[C@@H]1NC(=O)[C@H](CO)NC(=O)[C@H](Cc2c[nH]c3ccccc23)NC(=O)[C@@H]2CCCN2C(=O)[C@@H]2CSCc3cc(CSC[C@H](NC(=O)CNC(=O)[C@H](CO)NC1=O)C(=O)NCC(N)=O)cc(CSC[C@H](NC(=O)[C@H](C)N)C(=O)N[C@@H](CC(O)=O)C(=O)N[C@@H](CO)C(=O)N[C@@H](CCCN=C(N)N)C(=O)N[C@@H](Cc1ccccc1)C(=O)N[C@@H](CCCN=C(N)N)C(=O)N[C@@H](CC(N)=O)C(=O)N2)c3
: