Target
Urokinase-type plasminogen activator
Ligand
BDBM50326043
Substrate
Meas. Tech.
ChEMBL_655599 (CHEMBL1244643)
Ki
6700±n/a nM
Citation
 Heinis, CRutherford, TFreund, SWinter, G Phage-encoded combinatorial chemical libraries based on bicyclic peptides. Nat Chem Biol 5:502-7 (2009)  
Target
Name:
Urokinase-type plasminogen activator
Synonyms:
PLAU UROK_HUMAN Urokinase-type plasminogen activator (uPA) | Urokinase-type plasminogen activator/surface receptor
Type:
Enzyme
Mol. Mass.:
48528.62
Organism:
Homo sapiens (Human)
Description:
P00749
Residue:
431
  
Inhibitor
Name:
BDBM50326043
Synonyms:
(2R,5S,8S,11S,14S,17S)-11-((1H-imidazol-5-yl)methyl)-17-((2S,8S,11S,14S,17R)-11-((1H-indol-3-yl)methyl)-17-amino-8-(3-guanidinopropyl)-14-(hydroxymethyl)-2-isobutyl-18-mercapto-4,7,10,13,16-pentaoxo-3,6,9,12,15-pentaazaoctadecanamido)-14-(2-amino-2-oxoethyl)-8-(3-guanidinopropyl)-2-(mercaptomethyl)-5-(2-(methylthio)ethyl)-4,7,10,13,16-pentaoxo-3,6,9,12,15-pentaazaicosane-1,20-dioic acid | CHEMBL1240678
Type:
Small organic molecule
Emp. Form.:
C60H94N22O17S3
Mol. Mass.:
1491.721
SMILES:
CSCC[C@H](NC(=O)[C@H](CCCN=C(N)N)NC(=O)[C@H](Cc1cnc[nH]1)NC(=O)[C@H](CC(N)=O)NC(=O)[C@H](CCC(O)=O)NC(=O)[C@H](CC(C)C)NC(=O)CNC(=O)[C@H](CCCN=C(N)N)NC(=O)[C@H](Cc1c[nH]c2ccccc12)NC(=O)[C@H](CO)NC(=O)[C@@H](N)CS)C(=O)N[C@@H](CS)C(O)=O
: