Target
Histamine H3 receptor
Ligand
BDBM50326285
Substrate
Meas. Tech.
ChEMBL_659946 (CHEMBL1247347)
Ki
14±n/a nM
Citation
 Ishikawa, MWatanabe, TKudo, TYokoyama, FYamauchi, MKato, KKakui, NSato, Y Investigation of the histamine H3 receptor binding site. Design and synthesis of hybrid agonists with a lipophilic side chain. J Med Chem 53:6445-56 (2010)  
Target
Name:
Histamine H3 receptor
Synonyms:
G-protein coupled receptor 97 HH3R HRH3 Histamine H3 receptor (H3) Histamine receptor (H3 and H4)
Type:
G Protein-Coupled Receptor (GPCR)
Mol. Mass.:
48691.47
Organism:
Homo sapiens (Human)
Description:
Binding assays were using CHO cells stably expressing hH3R receptors.
Residue:
445
  
Inhibitor
Name:
BDBM50326285
Synonyms:
(S)-4-(1-(1H-Imidazol-4-yl)-2-(4-(trifluoromethyl)phenylthio)-ethyl)piperidine | CHEMBL1243394
Type:
Small organic molecule
Emp. Form.:
C17H20F3N3S
Mol. Mass.:
355.421
SMILES:
FC(F)(F)c1ccc(SC[C@@H](C2CCNCC2)c2cnc[nH]2)cc1
: