Target
Histamine H1 receptor
Ligand
BDBM50326286
Substrate
Meas. Tech.
ChEMBL_659949 (CHEMBL1247350)
Ki
48±n/a nM
Citation
 Ishikawa, MWatanabe, TKudo, TYokoyama, FYamauchi, MKato, KKakui, NSato, Y Investigation of the histamine H3 receptor binding site. Design and synthesis of hybrid agonists with a lipophilic side chain. J Med Chem 53:6445-56 (2010)  
Target
Name:
Histamine H1 receptor
Synonyms:
H1R HISTAMINE H1 HRH1_HUMAN
Type:
G Protein-Coupled Receptor (GPCR)
Mol. Mass.:
55808.72
Organism:
Homo sapiens (Human)
Description:
Cell pellets from SK-N-MC cells transfected with human H1 receptor were used in binding assay.
Residue:
487
  
Inhibitor
Name:
BDBM50326286
Synonyms:
(R)-4-(1-(1H-Imidazol-4-yl)-2-(4-(trifluoromethyl)phenylthio)ethyl)piperidine | CHEMBL1243395
Type:
Small organic molecule
Emp. Form.:
C17H20F3N3S
Mol. Mass.:
355.421
SMILES:
FC(F)(F)c1ccc(SC[C@H](C2CCNCC2)c2cnc[nH]2)cc1
: