Target
Prostaglandin G/H synthase 1
Ligand
BDBM50029593
Substrate
Meas. Tech.
ChEMBL_658293 (CHEMBL1246850)
IC50
14100±n/a nM
Citation
 Harrak, YCasula, GBasset, JRosell, GPlescia, SRaffa, DCusimano, MGPouplana, RPujol, MD Synthesis, anti-inflammatory activity, and in vitro antitumor effect of a novel class of cyclooxygenase inhibitors: 4-(aryloyl)phenyl methyl sulfones. J Med Chem 53:6560-71 (2010)  
Target
Name:
Prostaglandin G/H synthase 1
Synonyms:
COX1 Cyclooxygenase-1 (COX-1) PTGS1 | Prostaglandin G/H synthase (cyclooxygenase)
Type:
Protein
Mol. Mass.:
68868.60
Organism:
Ovis aries (Sheep)
Description:
Residue:
600
  
Inhibitor
Name:
BDBM50029593
Synonyms:
CHEMBL7162 N-(2-Cyclohexyloxy-4-nitro-phenyl)-methanesulfonamide N-[2-(cyclohexyloxy)-4-nitrophenyl]methane sulfonamide N-{2-(cyclohexyloxy)-4-[hydroxy(oxido)amino]phenyl}methanesulfonamide NS398
Type:
Small organic molecule
Emp. Form.:
C13H18N2O5S
Mol. Mass.:
314.357
SMILES:
CS(=O)(=O)Nc1ccc(cc1OC1CCCCC1)[N+]([O-])=O
: