Target
Prostaglandin G/H synthase 1
Ligand
BDBM50326522
Substrate
Meas. Tech.
ChEMBL_658293 (CHEMBL1246850)
IC50
80000±n/a nM
Citation
 Harrak, YCasula, GBasset, JRosell, GPlescia, SRaffa, DCusimano, MGPouplana, RPujol, MD Synthesis, anti-inflammatory activity, and in vitro antitumor effect of a novel class of cyclooxygenase inhibitors: 4-(aryloyl)phenyl methyl sulfones. J Med Chem 53:6560-71 (2010)  
Target
Name:
Prostaglandin G/H synthase 1
Synonyms:
COX1 Cyclooxygenase-1 (COX-1) PTGS1 | Prostaglandin G/H synthase (cyclooxygenase)
Type:
Protein
Mol. Mass.:
68868.60
Organism:
Ovis aries (Sheep)
Description:
Residue:
600
  
Inhibitor
Name:
BDBM50326522
Synonyms:
1-(4-fluorophenyl)-4-(4-(methylsulfonyl)phenyl)piperazine | CHEMBL1243100
Type:
Small organic molecule
Emp. Form.:
C17H19FN2O2S
Mol. Mass.:
334.408
SMILES:
CS(=O)(=O)c1ccc(cc1)N1CCN(CC1)c1ccc(F)cc1
: