Target
Oxytocin receptor
Ligand
BDBM50326714
Substrate
Meas. Tech.
ChEMBL_661536 (CHEMBL1253100)
Ki
0.63±n/a nM
Citation
 Borthwick, AD Oral oxytocin antagonists. J Med Chem 53:6525-38 (2010)  
Target
Name:
Oxytocin receptor
Synonyms:
OT-R OXYR_HUMAN | Oxytocin
Type:
Enzyme Catalytic Domain
Mol. Mass.:
42793.26
Organism:
Homo sapiens (Human)
Description:
Oxytocin OXTR HEK293::B2R9L7
Residue:
389
  
Inhibitor
Name:
BDBM50326714
Synonyms:
(3R,6R)-6-sec-butyl-3-(2,3-dihydro-1H-inden-2-yl)-6-methyl-1-((R)-1-(2-methyloxazol-4-yl)-2-morpholino-2-oxoethyl)piperazine-2,5-dione | CHEMBL1254533
Type:
Small organic molecule
Emp. Form.:
C28H36N4O5
Mol. Mass.:
508.6092
SMILES:
CC[C@H](C)[C@@]1(C)N([C@@H](C(=O)N2CCOCC2)c2coc(C)n2)C(=O)[C@H](NC1=O)C1Cc2ccccc2C1
: