Target
Oxytocin receptor
Ligand
BDBM50326719
Substrate
Meas. Tech.
ChEMBL_661537 (CHEMBL1253101)
Ki
3.6±n/a nM
Citation
 Borthwick, AD Oral oxytocin antagonists. J Med Chem 53:6525-38 (2010)  
Target
Name:
Oxytocin receptor
Synonyms:
OT-R Otr Oxytocin
Type:
Enzyme Catalytic Domain
Mol. Mass.:
42889.28
Organism:
RAT
Description:
Oxytocin OXTR RAT::P70536
Residue:
388
  
Inhibitor
Name:
BDBM50326719
Synonyms:
(S)-2-amino-N-((1S,2S,4R)-7,7-dimethyl-1-((4-o-tolylpiperazin-1-ylsulfonyl)methyl)bicyclo[2.2.1]heptan-2-yl)-4-(methylsulfonyl)butanamide | CHEMBL1253853
Type:
Small organic molecule
Emp. Form.:
C26H42N4O5S2
Mol. Mass.:
554.765
SMILES:
Cc1ccccc1N1CCN(CC1)S(=O)(=O)C[C@]12CC[C@H](C[C@@H]1NC(=O)[C@@H](N)CCS(C)(=O)=O)C2(C)C
: