Target
Vasopressin V1a receptor
Ligand
BDBM50326713
Substrate
Meas. Tech.
ChEMBL_661553 (CHEMBL1253117)
Ki
170±n/a nM
Citation
 Borthwick, AD Oral oxytocin antagonists. J Med Chem 53:6525-38 (2010)  
Target
Name:
Vasopressin V1a receptor
Synonyms:
AVPR V1a AVPR1A V1AR_HUMAN VASOPRESSIN V1A Vasopressin V1 receptor Vasopressin receptor
Type:
Receptor
Mol. Mass.:
46820.18
Organism:
Homo sapiens (Human)
Description:
P37288
Residue:
418
  
Inhibitor
Name:
BDBM50326713
Synonyms:
(2S,4Z)-N-[(2S)-2-hydroxy-2-phenylethyl]-4-(methoxyimino)-1-[(2'-methyl[1,1'-biphenyl]-4-yl)carbonyl]-2-pyrrolidinecarboxamide CHEMBL1254024
Type:
Small organic molecule
Emp. Form.:
C28H29N3O4
Mol. Mass.:
471.5476
SMILES:
CO\N=C1\C[C@H](N(C1)C(=O)c1ccc(cc1)-c1ccccc1C)C(=O)NC[C@@H](O)c1ccccc1
: