Target
Oxytocin receptor
Ligand
BDBM50326717
Substrate
Meas. Tech.
ChEMBL_661578 (CHEMBL1253142)
Ki
0.67±n/a nM
Citation
 Borthwick, AD Oral oxytocin antagonists. J Med Chem 53:6525-38 (2010)  
Target
Name:
Oxytocin receptor
Synonyms:
OT-R Otr Oxytocin
Type:
Enzyme Catalytic Domain
Mol. Mass.:
42889.28
Organism:
RAT
Description:
Oxytocin OXTR RAT::P70536
Residue:
388
  
Inhibitor
Name:
BDBM50326717
Synonyms:
4-ethoxy-N-(2-oxo-2-(2-(2-oxoindolin-3-ylidene)hydrazinyl)ethyl)-N-p-tolylbenzenesulfonamide | CHEMBL1254117
Type:
Small organic molecule
Emp. Form.:
C25H24N4O5S
Mol. Mass.:
492.547
SMILES:
CCOc1ccc(cc1)S(=O)(=O)N(CC(=O)NN=C1C(=O)Nc2ccccc12)c1ccc(C)cc1
: