Target
Vasopressin V2 receptor
Ligand
BDBM50326722
Substrate
Meas. Tech.
ChEMBL_661540 (CHEMBL1253104)
Ki
0.67±n/a nM
Citation
 Borthwick, AD Oral oxytocin antagonists. J Med Chem 53:6525-38 (2010)  
Target
Name:
Vasopressin V2 receptor
Synonyms:
ADHR AVPR2 DIR Renal-type arginine vasopressin receptor V2R_HUMAN Vasopressin V2 receptor | Vasopressin receptor
Type:
Receptor
Mol. Mass.:
40295.28
Organism:
Homo sapiens (Human)
Description:
P30518
Residue:
371
  
Inhibitor
Name:
BDBM50326722
Synonyms:
(Z)-3-(4-(N-(4-chlorophenyl)-N-(2-oxo-2-(2-(2-oxoindolin-3-ylidene)hydrazinyl)ethyl)sulfamoyl)phenyl)-N-(3-(dimethylamino)propyl)propanamide CHEMBL445816
Type:
Small organic molecule
Emp. Form.:
C30H33ClN6O5S
Mol. Mass.:
625.138
SMILES:
CN(C)CCCNC(=O)CCc1ccc(cc1)S(=O)(=O)N(CC(=O)N\N=C1/C(=O)Nc2ccccc12)c1ccc(Cl)cc1
: