Target
Oxytocin receptor
Ligand
BDBM50262153
Substrate
Meas. Tech.
ChEMBL_661577 (CHEMBL1253141)
Ki
304±n/a nM
Citation
 Borthwick, AD Oral oxytocin antagonists. J Med Chem 53:6525-38 (2010)  
Target
Name:
Oxytocin receptor
Synonyms:
OT-R OXYR_HUMAN | Oxytocin
Type:
Enzyme Catalytic Domain
Mol. Mass.:
42793.26
Organism:
Homo sapiens (Human)
Description:
Oxytocin OXTR HEK293::B2R9L7
Residue:
389
  
Inhibitor
Name:
BDBM50262153
Synonyms:
4-{2-[2-(3-Biphenyl-4-yl-5-methyl-[1,2,4]triazol-4-yl)-phenoxy]-ethyl}-morpholine | CHEMBL467154
Type:
Small organic molecule
Emp. Form.:
C27H28N4O2
Mol. Mass.:
440.5368
SMILES:
Cc1nnc(-c2ccc(cc2)-c2ccccc2)n1-c1ccccc1OCCN1CCOCC1
: