Target
Oxytocin receptor
Ligand
BDBM50262270
Substrate
Meas. Tech.
ChEMBL_661577 (CHEMBL1253141)
Ki
6±n/a nM
Citation
 Borthwick, AD Oral oxytocin antagonists. J Med Chem 53:6525-38 (2010)  
Target
Name:
Oxytocin receptor
Synonyms:
OT-R OXYR_HUMAN | Oxytocin
Type:
Enzyme Catalytic Domain
Mol. Mass.:
42793.26
Organism:
Homo sapiens (Human)
Description:
Oxytocin OXTR HEK293::B2R9L7
Residue:
389
  
Inhibitor
Name:
BDBM50262270
Synonyms:
2-(4-fluoro-2-methylphenyl)-5-(4-(6-methoxypyridin-3-yl)-5-methyl-4H-1,2,4-triazol-3-yl)pyrazine | CHEMBL467378
Type:
Small organic molecule
Emp. Form.:
C20H17FN6O
Mol. Mass.:
376.387
SMILES:
COc1ccc(cn1)-n1c(C)nnc1-c1cnc(cn1)-c1ccc(F)cc1C
: