Target
ATP-dependent translocase ABCB1
Ligand
BDBM50326929
Substrate
Meas. Tech.
ChEMBL_663342 (CHEMBL1250590)
IC50
1680±n/a nM
Citation
 Arnaud, OKoubeissi, AEttouati, LTerreux, RAlamé, GGrenot, CDumontet, CDi Pietro, AParis, JFalson, P Potent and fully noncompetitive peptidomimetic inhibitor of multidrug resistance P-glycoprotein. J Med Chem 53:6720-9 (2010)  
Target
Name:
ATP-dependent translocase ABCB1
Synonyms:
ABCB1 MDR1_HUMAN Multidrug resistance protein 1 P-glycoprotein (P-gp) PGY1
Type:
Protein
Mol. Mass.:
141503.50
Organism:
Homo sapiens (Human)
Description:
P08183
Residue:
1280
  
Inhibitor
Name:
BDBM50326929
Synonyms:
(2S,4R)-tert-butyl 2-((S)-6-(benzyloxycarbonylamino)-1-tert-butoxy-1-oxohexan-2-ylcarbamoyl)-4-(cyclohexanecarbonyloxy)pyrrolidine-1-carboxylate | CHEMBL1253373
Type:
Small organic molecule
Emp. Form.:
C35H53N3O9
Mol. Mass.:
659.81
SMILES:
CC(C)(C)OC(=O)[C@H](CCCCNC(=O)OCc1ccccc1)NC(=O)[C@@H]1C[C@H](CN1C(=O)OC(C)(C)C)OC(=O)C1CCCCC1
: