Target
Androgen receptor
Ligand
BDBM50131270
Substrate
Meas. Tech.
ChEMBL_663713 (CHEMBL1250613)
IC50
110000±n/a nM
Citation
 Fousteris, MASchubert, URoell, DRoediger, JBailis, NNikolaropoulos, SSBaniahmad, AGiannis, A 20-Aminosteroids as a novel class of selective and complete androgen receptor antagonists and inhibitors of prostate cancer cell growth. Bioorg Med Chem 18:6960-9 (2010)  
Target
Name:
Androgen receptor
Synonyms:
ANDR_HUMAN Androgen Receptor Androgen receptor/Baculoviral IAP repeat-containing protein 2 Dihydrotestosterone receptor Nuclear receptor subfamily 3 group C member 4
Type:
Receptor
Mol. Mass.:
99185.27
Organism:
Homo sapiens (Human)
Description:
CHO cells were stably transfected with human AR gene.
Residue:
920
  
Inhibitor
Name:
BDBM50131270
Synonyms:
2-methyl-N-[4-nitro-3-(trifluoromethyl)phenyl]propanamide CHEMBL806 FLUTAMIDE alpha,alpha,alpha-trifluoro-2-methyl-4'-nitro-m-propionotoluidide | niftolid
Type:
Small organic molecule
Emp. Form.:
C11H11F3N2O3
Mol. Mass.:
276.2118
SMILES:
CC(C)C(=O)Nc1ccc(c(c1)C(F)(F)F)[N+]([O-])=O
: