Target
Adenosine receptor A1
Ligand
BDBM50327339
Substrate
Meas. Tech.
ChEMBL_664373 (CHEMBL1259522)
IC50
6.4±n/a nM
Citation
 Griebenow, NBärfacker, LMeier, HSchneider, DTeusch, NLustig, KKast, RKolkhof, P Identification and optimization of substituted 5-aminopyrazoles as potent and selective adenosine A1 receptor antagonists. Bioorg Med Chem Lett 20:5891-4 (2010)  
Target
Name:
Adenosine receptor A1
Synonyms:
A1 adenosine receptor (hA1) AA1R_HUMAN ADORA1 Adenosine A1-receptor Adenosine receptor A1 (hA1) | Adenosine transporter (AdT)
Type:
G Protein-Coupled Receptor (GPCR)
Mol. Mass.:
36520.92
Organism:
Homo sapiens (Human)
Description:
P30542
Residue:
326
  
Inhibitor
Name:
BDBM50327339
Synonyms:
2-(1-(2-ethylphenyl)-3-methyl-4-(quinoxalin-6-yl)-1H-pyrazol-5-ylamino)-5-methoxybenzoic acid | CHEMBL1258621
Type:
Small organic molecule
Emp. Form.:
C28H25N5O3
Mol. Mass.:
479.5298
SMILES:
CCc1ccccc1-n1nc(C)c(c1Nc1ccc(OC)cc1C(O)=O)-c1ccc2nccnc2c1
: