Target
Maltase-glucoamylase
Ligand
BDBM50327501
Substrate
Meas. Tech.
ChEMBL_664635 (CHEMBL1260349)
Ki
170±n/a nM
Citation
 Eskandari, RJones, KRose, DRPinto, BM Probing the active-site requirements of human intestinal N-terminal maltase glucoamylase: the effect of replacing the sulfate moiety by a methyl ether in ponkoranol, a naturally occurringa-glucosidase inhibitor. Bioorg Med Chem Lett 20:5686-9 (2010)  
Target
Name:
Maltase-glucoamylase
Synonyms:
Alpha glucosidase MGA MGAML Maltase | Maltase-glucoamylase, intestinal
Type:
Enzyme
Mol. Mass.:
209817.06
Organism:
Homo sapiens (Human)
Description:
O43451
Residue:
1857
  
Inhibitor
Name:
BDBM50327501
Synonyms:
CHEMBL1258528 | ponkoranol
Type:
Small organic molecule
Emp. Form.:
C11H22O11S2
Mol. Mass.:
394.416
SMILES:
OC[C@H](O)[C@@H](O)[C@H](OS([O-])(=O)=O)[C@H](O)C[S@@+]1C[C@@H](O)[C@H](O)[C@H]1CO
: