Target
G-protein coupled bile acid receptor 1
Ligand
BDBM50327520
Substrate
Meas. Tech.
ChEMBL_664649 (CHEMBL1260363)
IC50
4300±n/a nM
Citation
 Herbert, MRSiegel, DLStaszewski, LCayanan, CBanerjee, UDhamija, SAnderson, JFan, AWang, LRix, PShiau, AKRao, TSNoble, SAHeyman, RABischoff, EGuha, MKabakibi, APinkerton, AB Synthesis and SAR of 2-aryl-3-aminomethylquinolines as agonists of the bile acid receptor TGR5. Bioorg Med Chem Lett 20:5718-21 (2010)  
Target
Name:
G-protein coupled bile acid receptor 1
Synonyms:
GPBAR_MOUSE M-BAR Tgr5
Type:
PROTEIN
Mol. Mass.:
35665.78
Organism:
Mus musculus
Description:
ChEMBL_1475560
Residue:
329
  
Inhibitor
Name:
BDBM50327520
Synonyms:
CHEMBL1258310 | N-(4-chlorobenzyl)-1-(7-methoxy-2-(thiophen-3-yl)quinolin-3-yl)methanamine
Type:
Small organic molecule
Emp. Form.:
C22H19ClN2OS
Mol. Mass.:
394.917
SMILES:
COc1ccc2cc(CNCc3ccc(Cl)cc3)c(nc2c1)-c1ccsc1
: