Target
G-protein coupled bile acid receptor 1
Ligand
BDBM50327541
Substrate
Meas. Tech.
ChEMBL_664649 (CHEMBL1260363)
IC50
320±n/a nM
Citation
 Herbert, MRSiegel, DLStaszewski, LCayanan, CBanerjee, UDhamija, SAnderson, JFan, AWang, LRix, PShiau, AKRao, TSNoble, SAHeyman, RABischoff, EGuha, MKabakibi, APinkerton, AB Synthesis and SAR of 2-aryl-3-aminomethylquinolines as agonists of the bile acid receptor TGR5. Bioorg Med Chem Lett 20:5718-21 (2010)  
Target
Name:
G-protein coupled bile acid receptor 1
Synonyms:
GPBAR_MOUSE M-BAR Tgr5
Type:
PROTEIN
Mol. Mass.:
35665.78
Organism:
Mus musculus
Description:
ChEMBL_1475560
Residue:
329
  
Inhibitor
Name:
BDBM50327541
Synonyms:
3-((4-bromophenethylamino)methyl)-7-methoxy-2-(thiophen-3-yl)quinolin-6-ol | CHEMBL1257732
Type:
Small organic molecule
Emp. Form.:
C23H21BrN2O2S
Mol. Mass.:
469.394
SMILES:
COc1cc2nc(-c3ccsc3)c(CNCCc3ccc(Br)cc3)cc2cc1O
: