Target
5-hydroxytryptamine receptor 1A
Ligand
BDBM50327587
Substrate
Meas. Tech.
ChEMBL_664675 (CHEMBL1260561)
Ki
0.312±n/a nM
Citation
 Favor, DAPowers, JJWhite, ADFitzgerald, LWGroppi, VSerpa, KA 6-Alkoxyisoindolin-1-one based dopamine D2 partial agonists as potential antipsychotics. Bioorg Med Chem Lett 20:5666-9 (2010)  
Target
Name:
5-hydroxytryptamine receptor 1A
Synonyms:
5-HT-1A 5-hydroxytryptamine receptor 1A (5-HT-1A) ADRB2RL1 Dopamine D2 receptor and serotonin 1a receptor HTR1A | Serotonin receptor 1A
Type:
Mol. Mass.:
46122.49
Organism:
Homo sapiens (Human)
Description:
Residue:
422
  
Inhibitor
Name:
BDBM50327587
Synonyms:
7-chloro-6-(3-(4-(8-fluoronaphthalen-1-yl)piperazin-1-yl)propoxy)isoindolin-1-one | CHEMBL1257146
Type:
Small organic molecule
Emp. Form.:
C25H25ClFN3O2
Mol. Mass.:
453.936
SMILES:
Fc1cccc2cccc(N3CCN(CCCOc4ccc5CNC(=O)c5c4Cl)CC3)c12
: