Target
5-hydroxytryptamine receptor 1A
Ligand
BDBM50327626
Substrate
Meas. Tech.
ChEMBL_664675 (CHEMBL1260561)
Ki
1.92±n/a nM
Citation
 Favor, DAPowers, JJWhite, ADFitzgerald, LWGroppi, VSerpa, KA 6-Alkoxyisoindolin-1-one based dopamine D2 partial agonists as potential antipsychotics. Bioorg Med Chem Lett 20:5666-9 (2010)  
Target
Name:
5-hydroxytryptamine receptor 1A
Synonyms:
5-HT-1A 5-hydroxytryptamine receptor 1A (5-HT-1A) ADRB2RL1 Dopamine D2 receptor and serotonin 1a receptor HTR1A | Serotonin receptor 1A
Type:
Mol. Mass.:
46122.49
Organism:
Homo sapiens (Human)
Description:
Residue:
422
  
Inhibitor
Name:
BDBM50327626
Synonyms:
6-(4-(4-(5,6,7,8-tetrahydronaphthalen-1-yl)piperazin-1-yl)butoxy)isoindolin-1-one | CHEMBL1257614
Type:
Small organic molecule
Emp. Form.:
C26H33N3O2
Mol. Mass.:
419.5591
SMILES:
O=C1NCc2ccc(OCCCCN3CCN(CC3)c3cccc4CCCCc34)cc12
: