Target
Potassium voltage-gated channel subfamily H member 2
Ligand
BDBM50327588
Substrate
Meas. Tech.
ChEMBL_664671 (CHEMBL1260557)
Ki
779±n/a nM
Citation
 Favor, DAPowers, JJWhite, ADFitzgerald, LWGroppi, VSerpa, KA 6-Alkoxyisoindolin-1-one based dopamine D2 partial agonists as potential antipsychotics. Bioorg Med Chem Lett 20:5666-9 (2010)  
Target
Name:
Potassium voltage-gated channel subfamily H member 2
Synonyms:
1,3-beta-glucan synthase component GLS2 ERG Eag-related protein 1 Ether-a-go-go-related gene (HERG) Ether-a-go-go-related gene potassium channel 1 Ether-a-go-go-related gene potassium channel 1 (hERG1) Ether-a-go-go-related protein 1 H-ERG KCNH2 Potassium voltage-gated channel subfamily H member 2 (hERG) Voltage-gated potassium channel subunit Kv11.1 hERG Potassium Channel 1 | putative potassium channel subunit
Type:
Multi-pass membrane protein
Mol. Mass.:
126672.65
Organism:
Homo sapiens (Human)
Description:
Q12809
Residue:
1159
  
Inhibitor
Name:
BDBM50327588
Synonyms:
5-(3-(4-(naphthalen-1-yl)piperazin-1-yl)propoxy)isoindoline | CHEMBL1258312
Type:
Small organic molecule
Emp. Form.:
C25H29N3O
Mol. Mass.:
387.5173
SMILES:
C(COc1ccc2CNCc2c1)CN1CCN(CC1)c1cccc2ccccc12
: