Target
Sodium-dependent serotonin transporter
Ligand
BDBM50327592
Substrate
Meas. Tech.
ChEMBL_664681 (CHEMBL1260567)
Ki
22.2±n/a nM
Citation
 Favor, DAPowers, JJWhite, ADFitzgerald, LWGroppi, VSerpa, KA 6-Alkoxyisoindolin-1-one based dopamine D2 partial agonists as potential antipsychotics. Bioorg Med Chem Lett 20:5666-9 (2010)  
Target
Name:
Sodium-dependent serotonin transporter
Synonyms:
5-HT Transporter 5HTT SC6A4_HUMAN SLC6A4 Serotonin transporter (5HTT) Sodium-dependent serotonin transporter (SERT) | Solute carrier family 6 member 4
Type:
Multi-pass membrane protein
Mol. Mass.:
70322.51
Organism:
Homo sapiens (Human)
Description:
P31645
Residue:
630
  
Inhibitor
Name:
BDBM50327592
Synonyms:
5-fluoro-6-(3-(4-(6-fluoronaphthalen-1-yl)piperazin-1-yl)propoxy)isoindolin-1-one | CHEMBL1258763
Type:
Small organic molecule
Emp. Form.:
C25H25F2N3O2
Mol. Mass.:
437.4817
SMILES:
Fc1ccc2c(cccc2c1)N1CCN(CCCOc2cc3C(=O)NCc3cc2F)CC1
: