Target
5-hydroxytryptamine receptor 4
Ligand
BDBM50327872
Substrate
Meas. Tech.
ChEMBL_664911 (CHEMBL1259743)
EC50
0.177828±n/a nM
Citation
 Xu, RHong, JMorse, CLPike, VW Synthesis, structure-affinity relationships, and radiolabeling of selective high-affinity 5-HT4 receptor ligands as prospective imaging probes for positron emission tomography. J Med Chem 53:7035-47 (2010)  
Target
Name:
5-hydroxytryptamine receptor 4
Synonyms:
5-HT-4 5-HT4S 5-HT4b 5-HT4d 5-hydroxytryptamine receptor 4 5HT4R_HUMAN Serotonin (5-HT) receptor Serotonin 4 (5-HT4) receptor | Serotonin Receptor 4
Type:
Enzyme
Mol. Mass.:
43767.54
Organism:
Homo sapiens (Human)
Description:
Q13639
Residue:
388
  
Inhibitor
Name:
BDBM50327872
Synonyms:
(1-Butylpiperidin-4-yl)methyl 4-Amino-2-methoxybenzoate | CHEMBL1258451
Type:
Small organic molecule
Emp. Form.:
C18H28N2O3
Mol. Mass.:
320.4265
SMILES:
CCCCN1CCC(COC(=O)c2ccc(N)cc2OC)CC1
: