Target
Protein kinase C beta type
Ligand
BDBM50327943
Substrate
Meas. Tech.
ChEMBL_665131 (CHEMBL1260394)
Ki
0.450000±n/a nM
Citation
 Yanagita, RCKamachi, HTanaka, KMurakami, ANakagawa, YTokuda, HNagai, HIrie, K Role of the phenolic hydroxyl group in the biological activities of simplified analogue of aplysiatoxin with antiproliferative activity. Bioorg Med Chem Lett 20:6064-6 (2010)  
Target
Name:
Protein kinase C beta type
Synonyms:
KPCB_HUMAN PKC beta PKCB PRKCB1 Protein kinase C beta type | Protein kinase C beta type II (PRKCB2)
Type:
Enzyme
Mol. Mass.:
76873.67
Organism:
Homo sapiens (Human)
Description:
The recombinant human PKC enzymes were produced using a baculovirus expression system in SF9 cells
Residue:
671
  
Inhibitor
Name:
BDBM50327943
Synonyms:
Aplysiatoxin | CHEMBL1256416
Type:
Small organic molecule
Emp. Form.:
C32H47BrO10
Mol. Mass.:
671.614
SMILES:
CO[C@@H](CC[C@H](C)[C@H]1O[C@@]23C[C@H](OC(=O)C[C@@H](OC(=O)C[C@](O)(O2)[C@H](C)CC3(C)C)[C@@H](C)O)[C@@H]1C)c1cc(O)ccc1Br
: