Target
Breakpoint cluster region protein/Tyrosine-protein kinase ABL1
Ligand
BDBM50328136
Substrate
Meas. Tech.
ChEMBL_665342 (CHEMBL1261019)
Kd
43±n/a nM
Citation
 Deng, XOkram, BDing, QZhang, JChoi, YAdrián, FJWojciechowski, AZhang, GChe, JBursulaya, BCowan-Jacob, SWRummel, GSim, TGray, NS Expanding the diversity of allosteric bcr-abl inhibitors. J Med Chem 53:6934-46 (2010)  
Target
Name:
Breakpoint cluster region protein/Tyrosine-protein kinase ABL1
Synonyms:
Bcr-Abl Breakpoint cluster region protein /Tyrosine-protein kinase ABL | Tyrosine-protein kinase ABL1/Breakpoint cluster region protein
Type:
Enzyme
Mol. Mass.:
Description:
Components:
This complex has 2 components.
Component 1
Name:
Tyrosine-protein kinase ABL1
Synonyms:
ABL ABL1_HUMAN JTK7 Proto-oncogene tyrosine-protein kinase ABL1 Tyrosine-protein kinase ABL V-abl Abelson murine leukemia viral oncogene homolog 1 p150 | tyrosine-protein kinase ABL1 isoform a
Type:
Enzyme
Mol. Mass.:
122897.30
Organism:
Homo sapiens (Human)
Description:
P00519
Residue:
1130
  
Component 2
Name:
Breakpoint cluster region protein
Synonyms:
BCR BCR_HUMAN Breakpoint cluster region protein | D22S11
Type:
PROTEIN
Mol. Mass.:
142824.75
Organism:
Homo sapiens (Human)
Description:
ChEMBL_305348
Residue:
1271
  
Inhibitor
Name:
BDBM50328136
Synonyms:
6-(1H-pyrazol-4-yl)-N-(4-(trifluoromethoxy)phenyl)pyrimidin-4-amine US9670214, TABLE 16.43
Type:
Small organic molecule
Emp. Form.:
C14H10F3N5O
Mol. Mass.:
321.2573
SMILES:
FC(F)(F)Oc1ccc(Nc2cc(ncn2)-c2cn[nH]c2)cc1
: