Target
Alpha-1A adrenergic receptor
Ligand
BDBM50001786
Substrate
Meas. Tech.
ChEMBL_665656 (CHEMBL1261587)
Ki
0.37±n/a nM
Citation
 Kristensen, JLPüschl, AJensen, MRisgaard, RChristoffersen, CTBang-Andersen, BBalle, T Exploring the neuroleptic substituent in octoclothepin: potential ligands for positron emission tomography with subnanomolar affinity fora(1)-adrenoceptors. J Med Chem 53:7021-34 (2010)  
Target
Name:
Alpha-1A adrenergic receptor
Synonyms:
ADA1A_BOVIN ADRA1C Alpha 1A-adrenoreceptor Cerebral cortex alpha adrenergic receptor | adrenergic Alpha1
Type:
Enzyme Catalytic Domain
Mol. Mass.:
51492.08
Organism:
CALF
Description:
adrenergic Alpha1 0 CALF
Residue:
466
  
Inhibitor
Name:
BDBM50001786
Synonyms:
1-(2-{4-[5-chloro-1-(4-fluorophenyl)-1H-indol-3-yl]piperidin-1-yl}ethyl)imidazolidin-2-one CHEMBL12713 | Sertindole
Type:
Small organic molecule
Emp. Form.:
C24H26ClFN4O
Mol. Mass.:
440.941
SMILES:
Fc1ccc(cc1)-n1cc(C2CCN(CCN3CCNC3=O)CC2)c2cc(Cl)ccc12
: