Target
Alpha-1A adrenergic receptor
Ligand
BDBM50122815
Substrate
Meas. Tech.
ChEMBL_665656 (CHEMBL1261587)
Ki
0.23±n/a nM
Citation
 Kristensen, JLPüschl, AJensen, MRisgaard, RChristoffersen, CTBang-Andersen, BBalle, T Exploring the neuroleptic substituent in octoclothepin: potential ligands for positron emission tomography with subnanomolar affinity fora(1)-adrenoceptors. J Med Chem 53:7021-34 (2010)  
Target
Name:
Alpha-1A adrenergic receptor
Synonyms:
ADA1A_BOVIN ADRA1C Alpha 1A-adrenoreceptor Cerebral cortex alpha adrenergic receptor | adrenergic Alpha1
Type:
Enzyme Catalytic Domain
Mol. Mass.:
51492.08
Organism:
CALF
Description:
adrenergic Alpha1 0 CALF
Residue:
466
  
Inhibitor
Name:
BDBM50122815
Synonyms:
1-(2-{4-[1-(4-Fluoro-phenyl)-5-(2-methyl-2H-tetrazol-5-yl)-1H-indol-3-yl]-piperidin-1-yl}-ethyl)-imidazolidin-2-one | CHEMBL319352
Type:
Small organic molecule
Emp. Form.:
C26H29FN8O
Mol. Mass.:
488.5599
SMILES:
Cn1nnc(n1)-c1ccc2n(cc(C3CCN(CCN4CCNC4=O)CC3)c2c1)-c1ccc(F)cc1
: