Target
Alpha-1A adrenergic receptor
Ligand
BDBM50328481
Substrate
Meas. Tech.
ChEMBL_665656 (CHEMBL1261587)
Ki
0.26±n/a nM
Citation
 Kristensen, JLPüschl, AJensen, MRisgaard, RChristoffersen, CTBang-Andersen, BBalle, T Exploring the neuroleptic substituent in octoclothepin: potential ligands for positron emission tomography with subnanomolar affinity fora(1)-adrenoceptors. J Med Chem 53:7021-34 (2010)  
Target
Name:
Alpha-1A adrenergic receptor
Synonyms:
ADA1A_BOVIN ADRA1C Alpha 1A-adrenoreceptor Cerebral cortex alpha adrenergic receptor | adrenergic Alpha1
Type:
Enzyme Catalytic Domain
Mol. Mass.:
51492.08
Organism:
CALF
Description:
adrenergic Alpha1 0 CALF
Residue:
466
  
Inhibitor
Name:
BDBM50328481
Synonyms:
1-Methyl-4-(8-(1-methyl-1H-pyrazol-3-yl)-10,11-dihydrodibenzo[b,f]thiepin-10-yl)piperazine | CHEMBL1259232
Type:
Small organic molecule
Emp. Form.:
C23H26N4S
Mol. Mass.:
390.544
SMILES:
CN1CCN(CC1)C1Cc2ccccc2Sc2ccc(cc12)-c1ccn(C)n1
: