Target
Alpha-1D adrenergic receptor
Ligand
BDBM50328474
Substrate
Meas. Tech.
ChEMBL_665658 (CHEMBL1261589)
Ki
0.69±n/a nM
Citation
 Kristensen, JLPüschl, AJensen, MRisgaard, RChristoffersen, CTBang-Andersen, BBalle, T Exploring the neuroleptic substituent in octoclothepin: potential ligands for positron emission tomography with subnanomolar affinity fora(1)-adrenoceptors. J Med Chem 53:7021-34 (2010)  
Target
Name:
Alpha-1D adrenergic receptor
Synonyms:
ADA1D_RAT Adra1d Alpha-1D adrenergic receptor | Serotonin 1a (5-HT1a) receptor/Adrenergic receptor alpha-1
Type:
Protein
Mol. Mass.:
59375.97
Organism:
Rattus norvegicus (Rat)
Description:
P23944
Residue:
561
  
Inhibitor
Name:
BDBM50328474
Synonyms:
1-(2-(4-(5-(aminomethyl)-1-(4-fluorophenyl)-1H-indol-3-yl)piperidin-1-yl)ethyl)imidazolidin-2-one | CHEMBL1259172
Type:
Small organic molecule
Emp. Form.:
C25H30FN5O
Mol. Mass.:
435.537
SMILES:
NCc1ccc2n(cc(C3CCN(CCN4CCNC4=O)CC3)c2c1)-c1ccc(F)cc1
: