Target
D(2) dopamine receptor
Ligand
BDBM50007567
Substrate
Meas. Tech.
ChEMBL_665660 (CHEMBL1261591)
Ki
7.3±n/a nM
Citation
 Kristensen, JLPüschl, AJensen, MRisgaard, RChristoffersen, CTBang-Andersen, BBalle, T Exploring the neuroleptic substituent in octoclothepin: potential ligands for positron emission tomography with subnanomolar affinity fora(1)-adrenoceptors. J Med Chem 53:7021-34 (2010)  
Target
Name:
D(2) dopamine receptor
Synonyms:
D(2) dopamine receptor DOPAMINE D2 Long DRD2 Dopamine D2 receptor Dopamine D2 receptor (D2R) Dopamine2-like | d2
Type:
Cell-surface receptors
Mol. Mass.:
50647.10
Organism:
Homo sapiens (Human)
Description:
P14416
Residue:
443
  
Inhibitor
Name:
BDBM50007567
Synonyms:
1-(8-Chloro-10,11-dihydro-dibenzo[b,f]thiepin-10-yl)-4-methyl-piperazine OCTOCLOTHEPIN-R
Type:
Small organic molecule
Emp. Form.:
C19H21ClN2S
Mol. Mass.:
344.901
SMILES:
CN1CCN(CC1)[C@@H]1Cc2ccccc2Sc2ccc(Cl)cc12
: