Target
5-hydroxytryptamine receptor 2C
Ligand
BDBM50328505
Substrate
Meas. Tech.
ChEMBL_665659 (CHEMBL1261590)
Ki
8±n/a nM
Citation
 Kristensen, JLPüschl, AJensen, MRisgaard, RChristoffersen, CTBang-Andersen, BBalle, T Exploring the neuroleptic substituent in octoclothepin: potential ligands for positron emission tomography with subnanomolar affinity fora(1)-adrenoceptors. J Med Chem 53:7021-34 (2010)  
Target
Name:
5-hydroxytryptamine receptor 2C
Synonyms:
5-HT-2C 5-HT2C-INI 5-HTR2C 5-hydroxytryptamine receptor 2C (5-HT-2C) 5HT-1C HTR1C Serotonin (5-HT3) receptor Serotonin Receptor 2C
Type:
G Protein-Coupled Receptor (GPCR)
Mol. Mass.:
51836.79
Organism:
Homo sapiens (Human)
Description:
P28335
Residue:
458
  
Inhibitor
Name:
BDBM50328505
Synonyms:
(R)-N-((11-(4-methylpiperazin-1-yl)-10,11-dihydrodibenzo[b,f]thiepin-2-yl)methyl)isobutyramide | CHEMBL1259189
Type:
Small organic molecule
Emp. Form.:
C24H31N3OS
Mol. Mass.:
409.587
SMILES:
CC(C)C(=O)NCc1ccc2Sc3ccccc3C[C@@H](N3CCN(C)CC3)c2c1
: