Target
Alpha-1B adrenergic receptor
Ligand
BDBM50328478
Substrate
Meas. Tech.
ChEMBL_665666 (CHEMBL1261597)
Ki
0.15±n/a nM
Citation
 Kristensen, JLPüschl, AJensen, MRisgaard, RChristoffersen, CTBang-Andersen, BBalle, T Exploring the neuroleptic substituent in octoclothepin: potential ligands for positron emission tomography with subnanomolar affinity fora(1)-adrenoceptors. J Med Chem 53:7021-34 (2010)  
Target
Name:
Alpha-1B adrenergic receptor
Synonyms:
ADA1B_RAT Alpha 1B-adrenoceptor Alpha adrenergic receptor 1A and 1B Alpha-1Adrenoceptor Alpha-1B adrenoreceptor | adrenergic Alpha1B
Type:
G Protein-Coupled Receptor (GPCR)
Mol. Mass.:
56606.71
Organism:
Rattus norvegicus (rat)
Description:
Receptor binding assays were performed using rat cortical membranes.
Residue:
515
  
Inhibitor
Name:
BDBM50328478
Synonyms:
1-Methyl-4-(8-(2-methyl-2H-tetrazol-5-yl)-10,11-dihydrodibenzo[b,f]thiepin-10-yl)piperazine | CHEMBL1259216
Type:
Small organic molecule
Emp. Form.:
C21H24N6S
Mol. Mass.:
392.52
SMILES:
CN1CCN(CC1)C1Cc2ccccc2Sc2ccc(cc12)-c1nnn(C)n1
: