Target
Alpha-1D adrenergic receptor
Ligand
BDBM50328505
Substrate
Meas. Tech.
ChEMBL_665658 (CHEMBL1261589)
Ki
0.64±n/a nM
Citation
 Kristensen, JLPüschl, AJensen, MRisgaard, RChristoffersen, CTBang-Andersen, BBalle, T Exploring the neuroleptic substituent in octoclothepin: potential ligands for positron emission tomography with subnanomolar affinity fora(1)-adrenoceptors. J Med Chem 53:7021-34 (2010)  
Target
Name:
Alpha-1D adrenergic receptor
Synonyms:
ADA1D_RAT Adra1d Alpha-1D adrenergic receptor | Serotonin 1a (5-HT1a) receptor/Adrenergic receptor alpha-1
Type:
Protein
Mol. Mass.:
59375.97
Organism:
Rattus norvegicus (Rat)
Description:
P23944
Residue:
561
  
Inhibitor
Name:
BDBM50328505
Synonyms:
(R)-N-((11-(4-methylpiperazin-1-yl)-10,11-dihydrodibenzo[b,f]thiepin-2-yl)methyl)isobutyramide | CHEMBL1259189
Type:
Small organic molecule
Emp. Form.:
C24H31N3OS
Mol. Mass.:
409.587
SMILES:
CC(C)C(=O)NCc1ccc2Sc3ccccc3C[C@@H](N3CCN(C)CC3)c2c1
: